Home > Error Code > Install Failed With Error Code 1602

Install Failed With Error Code 1602

Contents

Permalink 0 Adam Ruth September 21, 2011 21:15 Try putting the /log parameter first and see if that helps. ERROR_DATATYPE_MISMATCH1629The data supplied is the wrong type. ERROR_INSTALL_PACKAGE_OPEN_FAILED1619This installation package could not be opened. Error MSI (s) (24:90) [15:35:52:584]: Product: AgentInstall64 -- Installation operation failed. weblink

Like Show 0 Likes(0) Actions 14. ERROR_PATCH_PACKAGE_OPEN_FAILED1635This patch package could not be opened. ERROR_SUCCESS_REBOOT_REQUIRED3010A restart is required to complete the install. Did this article resolve your issue? https://vox.veritas.com/t5/Backup-Exec/Install-failed-with-error-code-1602/td-p/577380

Error Code 1603

ERROR_INVALID_COMMAND_LINE1639Invalid command line argument. Verify that the Temp folder exists and that you can write to it. Privacy statement  © 2016 Microsoft. Counter after decrement: -1 MSI (c) (18:58) [15:35:53:114]: MainEngineThread is returning 1602 Cause Customer generated their own 45 character Uninstall Password without using theUninstallPwdKeyGenerator.exe.

Available beginning with Windows Installer version 4.0. Contact your system administrator. I think a lot of the Dell E-series machines have the hard drive mode set to IRRT, which is not supported. If it is failing to uninstall too ,you can follow the link given above by Craig to remove it manually and then after doing it restart the server and also clean

Click "User Account Control Settings"Set the slider in the panel to the bottom.Restart your system.Repeat step 1. Reconfiguration Success Or Error Status 1602 The files will be combined to form the full Backup Exec 2010 ISO.   Solution Identify any environmental situation that could possibly corrupt the files during download.   Terms of use Contact your support personnel to verify that the Windows Installer service is properly registered. https://www.veritas.com/support/en_US/article.000008171 Well, if the user is cancelling the installation, you cannot force it to install if the installation is interactive allowing the user to interrupt that activity.

Try these resources. ERROR_FUNCTION_NOT_CALLED1626The function could not be executed. We appreciate your feedback. Permalink 0 Jason Riker September 21, 2011 22:00 Adam, After going over the file, I saw the same thing.  Thanks again for all your help.

Reconfiguration Success Or Error Status 1602

Exit Safe Mode and try again or try using System Restore to return your computer to a previous state. https://msdn.microsoft.com/en-us/library/windows/desktop/aa376931(v=vs.85).aspx Available beginning with Windows Installer version 3.0. Error Code 1603 More discussions in Acrobat Windows (read-only) All CommunitiesAcrobatAcrobat Windows (read-only) 14 Replies Latest reply on Aug 31, 2010 1:35 PM by whostandsforwhat Error code: 1602 ArtuoCompean1970 Jun 4, 2010 4:03 PM Psexec ERROR_INDEX_ABSENT1611The component qualifier not present.

http://sourceforge.net/projects/smsclictr - Config Mgr Client Center http://www.myitforum.com/myITWiki/SCCMTools.ashx - SCCM Right click tools and more The tools can be installed on any Config Mgr. have a peek at these guys Do not stretch the technology for what commonsense should resolve. Permalink 0 Adam Ruth September 21, 2011 21:33 It looks like Reader is currently running on the computer and the installer can't continue while its locking some files: ADelRCP logging: : Showing results for  Search instead for  Do you mean  VOX : Backup and Recovery : Backup Exec : Install failed with error code 1602 VOX : Backup and Recovery : Backup

Or, you can add a line to your precheck.txt file: AllowRAID=Yes (however, that hasn't always worked for me) Chris Watkins Posts: 158 Registered: 3/5/09 Re: R72 FDE on Del E6400 -Installation This message is indicative of a success. Counter after increment: 0 MSI (s) (24:3C) [15:35:52:724]: Note: 1: 1402 2: HKEY_LOCAL_MACHINE\Software\Microsoft\Windows\CurrentVersion\Installer\Rollback\Scripts 3: 2 MSI (s) (24:3C) [15:35:52:724]: Note: 1: 1402 2: HKEY_LOCAL_MACHINE\Software\Microsoft\Windows\CurrentVersion\Installer\Rollback\Scripts 3: 2 MSI (s) (24:3C) [15:35:52:724]: Note: check over here Available beginning with Windows Installer version 3.0.

Re: Error code: 1602 LeoAdobeX Jun 13, 2010 12:31 PM (in response to ArtuoCompean1970) Can you post last section of info from AdobeARM.log file?The file is in the User's Temp folder. The product code for the newer ISScript products clashes with the one CP is trying to use in the background, and this stopped the installation going ahead.I found ISScript8.msi, and ISScript1050.msi Email Address (Optional) Your feedback has been submitted successfully!

If counter >= 0, shutdown will be denied.

You must install a Windows service pack that contains a newer version of the Windows Installer service. ERROR_CREATE_FAILED1631The Windows Installer service failed to start. Re: Error code: 1602 whostandsforwhat Aug 31, 2010 1:35 PM (in response to ArtuoCompean1970) Awesome I do hope that fixes this issue.JRATL Like Show 0 Likes(0) Actions Go to original post The advertised setting is configured as "Always rerun program" which means that everytime I place the computer in the collection, office installation starts.

Re: Error code: 1602 TheFourthCraw Jun 13, 2010 11:21 AM (in response to ArtuoCompean1970) Acrobat Updater also has an Error 1602.See this: http://kb2.adobe.com/cps/837/cpsid_83709/attachments/Acrobat_Reader_Updater.pdfUnfortunately it seems they are still deciding on a You may also refer to the English Version of this knowledge base article for up-to-date information. Re: Error code: 1602 ArtuoCompean1970 Jun 13, 2010 1:48 PM (in response to LeoAdobeX) function(){return A.apply(null,[this].concat($A(arguments)))}LeoAdobeX wrote:Can you post last section of info from AdobeARM.log file?The file is in the User's this content Supported Products A-Z Get support for your product, with downloads, knowledge base articles, documentation, and more.

Like Show 0 Likes(0) Actions 6. Verify that the specified log file location exists and is writable. TECH228266 July 13th, 2015 http://www.symantec.com/docs/TECH228266 Support / Endpoint Agent Fails to install: Error code 1602. ERROR_BAD_CONFIGURATION1610The configuration data for this product is corrupt.

No Yes Did this article save you the trouble of contacting technical support? I have Adobe CS4 Design Premium, and yet the Adobe Updater for Acrobat tries to run; when it does, it comes up with error 1602. (This machine does not have Reader.) ERROR_INVALID_DATA13The data is invalid. Article:000008171 Publish: Article URL:http://www.veritas.com/docs/000008171 Support / Article Sign In Remember me Forgot Password? Don't have a Veritas Account? Create a Veritas Account now! Welcome First Last Your Profile Logout Sign in