Home > Installshield Error > Installshield Error 6645

Installshield Error 6645

Created: 2002-08-02 InstallShield tracking number: 1-9I0NL Default Icon Missing from COM Extraction Description: During COM Extraction the default icon is not extracted when the registry entry is just the file name To resolve this warning, use the Premier edition of InstallShield to build the release. -7214 Error loading table %1. to locate files on a server), if the user does not have write access to that path, INSTALLDIR will be changed. The device driver feature will not be fully functional until an update has been provided. check over here

The application manifest specifies the minimum privilege level required by your installation's Setup.exe file for running the installation (the setup launcher, any InstallShield prerequisites, and the .msi file) on Windows Vista Check the Knowledge Base for information about this error, or request technical support. -6601 An error occurred while attempting to set the property %1 in the upgraded image. Check the Knowledge Base for information about this error, or request technical support. -6631 InstallScript MSI projects do not have Multiple Instance support. Check the Knowledge Base for information about this error, or request technical support. -6616 An error occurred while setting the key path for component %1.

The User Interface sequence does not run in InstallScript MSI installations; the event-driven InstallScript code handles the user interface. Setup will now terminate." Cause: An incompatible version of one or more OLE files have been installed on the failing machine. Code sample: nResult = PathAdd("c:\\dir.1\\test", "", FULL, AFTER); nResult = PathAdd("c:\\dir.2\\test", "", FULL, AFTER); The resulting path is just "c:\dir.1\test". The time now is 06:02 PM. -- Desktop -- Default Mobile Style Archive Service-Level Agreement Top Stay Connected RSS YouTube Twitter LinkedIn Xing Weibo What We Do Software License Optimization Application

  1. This results in compile errors.
  2. As an alternative, set up your installation so that it supports all platforms and/or processors. -7015 Error copying setup.inx to media folder.
  3. Vale Software is an SQL Documenter program I installed yesterday.

Created: 2002-09-06 InstallShield tracking number: INSTALLDIR Reverts Back to the Default Directory Description: If a path is entered during an installation, MSI verifies the path to determine that the installer has Worked a treat!” Valda- 1 Month Ago “Thanks for sharing, I no longer have to put up with the dreaded Installshield Error 6645” Delicia- 2 Months Ago “Will this work with Verify that Windows Installer is installed properly on the build system. -7086 The device driver installation framework is not currently available. Cause: The merge module installs MDAC only if the version installed is less than or equal to 2.52.

For more information about the differences between Advanced UI and Suite/Advanced UI projects, see Advanced UI Projects vs. b. Powered by vBulletin Version 4.2.2 Copyright © 2016 vBulletin Solutions, Inc. http://forum.installsite.net/index.php?showtopic=11077 To resolve this error message, you have two options. • Change the target destination for the assembly to a location other than the Global Assembly Cache if sharing that assembly with

Also, be sure to delete all files and folders under the C:\users\yourusername\AppData\Local|temp Also clean out C:\windows\temp #14 reghakr, Jun 3, 2009 marcwomack New MemberJoined:Jun 6, 2009Messages:2Likes Received:0 Totally different track here. To resolve this build warning, install .NET Framework 3.5 on your build machine. -7255 Only .pfx files can be used to digitally sign a software identification tag file. Please copy instmsi.exe from the MSI 3.0 Beta folder to \redist\Language Independent\i386\MSI3.0\instmsiw.exe. Check the Knowledge Base for information about this error, or request technical support. -6612 Internal build error.

Error: 0 Error Description: Adding file 'Microsoft.VisualBasic.Compatibility.dll' that is a dependency of component 'UserSQLServer.exe' Adding file 'stdole.dll' that is a dependency of component 'UserSQLServer.exe' ISEXP : error -6645: C:\WINDOWS\system32\mscomctl.ocx failed to Check the Knowledge Base for information about this error, or request technical support. -6563 An error occurred while writing the target image '%1' to the patch configuration properties file. It is also reproducible in ISD 7.00 and in InstallShield Professional Standard Edition 6.x. Help us please!

To resolve this error, try one of the following options: • Create a new .dll that has a standard Windows Installer entry point and call it directly. • Use InstallScript code check my blog Build Errors and Warnings Error or Warning Number Message Troubleshooting Information -32000 Build canceled by the user. Error: 0 Error Description: ISEXP : error -6645: C:\WINDOWS\system32\scrrun.dll failed to load. This, in turn, extracts your .dll from the Binary table and calls the function that you specified.

Workarounds: Add U2FWORDW.DLL to your project and install it to [WindowsFolder]\Crystal. Not fixed in ISD 7.01 - 8.02. Workarounds: None. http://mttags.com/installshield-error/installshield-error-1.php InstallScript uses COM to call MsiSetTarget, and thus relies on the Windows message queue.

A Suite/Advanced UI project, which is available in the Premier edition of InstallShield, includes support for multiple primary packages; however, an Advanced UI project, which is available in the Professional edition If you include multiple language versions in a setup, the wrong language files may get installed. In order for InstallShield to replace an asterisk in a condition with the appropriate information (such as the product code or product version) from a package in an Advanced UI or

In the 'Application Files' page, add some files to a feature.

Do not run the action on an uninstallation. (?ComponentName=3) AND NOT($ComponentName=2) • If the custom action is sequenced after InstallFiles—Run the action only if the component will be installed locally. ($ComponentName=3) Check the Knowledge Base for information about this error, or request technical support. -6628 The value for the property InstanceId is duplicated with a value in the ISProductConfigurationInstance table. Workaround: None. If the error recurs, you have identified the problematic merge module.

This will install MDAC 2.52 on the target machine if the version of MDAC is strictly less than 2.52. Created: 2002-01-22 Last update: 2002-06-14 InstallShield tracking number: 1-78UD1 Major Upgrade Patch Fails for Standard Projects Description: You cannot install a major upgrade to a Standard project as a patch. This error occurs if you try to call a deferred-, rollback-, or commit-execution custom action using a standard .dll. have a peek at these guys ReserveCost has the English GUID associated with the Component field.

Check the Knowledge Base for information about this error, or request technical support. -6604 Internal build error. Error: 0 Error Description: Adding merge module 'MSDE 2000 Distributed Management Objects (DMO)' that is a dependency of component 'Interop.SQLDMO.dll' ISEXP : error -6645: C:\Program Files\Vale Software\SQL Documentor\Binn\sqldmo.dll failed to load. The same can happen while building the release if you selected the option to extract self registration information during the build. If so, right-clcik on it and choose uninstall. #10 reghakr, Jun 3, 2009 Carpz New MemberJoined:Jun 1, 2009Messages:14Likes Received:0 I did that, restarted and windows automatically reinstalled the driver when i

Error: 0 Error Description: ISEXP : error -6645: C:\Program Files\Microsoft SQL Server\80\Tools\Binn\SQLDMO.dll failed to load. Note, however, that this may result in user interface issues in some scenarios because the Windows Installer does not fully support UTF-8 databases. Status: InstallShield has confirmed that this issue still exists in ISDev 8.02 and DevStuio 9.00. You can ignore this warning if end users will launch your release from a location whose path does not contain Unicode characters that are not supported by your build machine's ANSI

This error occurs if Setup.inx, the compiled script file, cannot be copied to the Media folder located in the \Media\\Disk Images\Disk 1 folder.