Home > Internal Compiler > Internal Compiler Error Code Gen

Internal Compiler Error Code Gen

Contents

Comment 2 Ben 2008-07-16 07:58:54 EDT I'm able to reproduce this problem using the following class: package com.test; public class Test { public Test() {} public Test(String s) {} { for Thanks!

Tags c# and .net Comments (11) Cancel reply Name * Email * Website Craig Nicholson says: April 9, 2005 at 4:35 pm It would be great if the MSDN You have to detect what construct causes this indication and rewrite it somehow. An internal error has occurred in the compiler. have a peek at these guys

We'll investigate at that point and contact you if we need some more info. High School Trigonometric Integration I beat the wall of flesh but the jungle didn't grow restless Why do people move their cameras in a square motion? The error output you'd see if you run into it would be similar to the following: Microsoft (R) Visual C# .NET Compiler version 7.10.4133.4 for Microsoft (R) .NET Framework version 1.1.4322 Reload to refresh your session. have a peek at these guys

Internal Compiler Error Killed (program Cc1plus)

The problem is the 7.1 (Everett) version of the C# compiler crashes (ICEs) when attempting to create a pdb where one already exists that was created with a more recent version I'll be blogging this tonight 🙂 Reply Steve Moxon says: April 13, 2006 at 4:19 am Nice post, and quick solution. What is the difference between "al la domo" and "en la domon"? Linked 6 fatal error C1001: An internal error has occurred in the compiler -1 error C1001: An internal error has occurred in the compiler in Debug mode Related 1Visual Studio 2005

  1. I have another development box setup with the exact same setup.
  2. Then I did a clean solution anda complete rebuild.
  3. Top Kevin D. (Intel) Mon, 12/15/2014 - 11:29 I reproduced the error but have not yet been able to isolate the cause to a specific phase of the compilation and thus
  4. compilation aborted for crash2.f (code 1) when compiled using: ifort -gen-interfaces -diag-disable 8290,8577 -c crash2.f Under Red Hat Enterprise Linux 6.6 For both 2013 SP1 Update 4 and 2015 Update 1

Top chauvjo Mon, 12/15/2014 - 10:46 Kevin, Any updates on this issue? Related Content Join the 15-year community celebration. ili opcode: 0 (mpisim.C: 225) PGCC-S-0000-Internal compiler error. Check every time you get rid of an asset folder to see if your errors change.

Worst case I'll upgrade to Visual Studio 2010 but this would require a lot of work to migrate all projects. My advice is to: 1) Check all your scripts to see if there are any duplicate names, make sure you keep them organized in folders to make this simpler! The weird thing was everything was working just fine a day ago. https://blogs.msdn.microsoft.com/gusperez/2005/04/09/c-compiler-bug-workaround/ Reload to refresh your session.

Thanks.... Otherwise it is likely a problem with the compiler. Locations at the top of the list are closer to the point at which the internal error occurred. Browse other questions tagged visual-c++ c1001 or ask your own question.

Gcc Internal Compiler Error

Bug241044 - Internal compiler error java.lang.IllegalArgumentException: info cannot be null Summary: Internal compiler error java.lang.IllegalArgumentException: info cannot be null Status: VERIFIED DUPLICATE of bug 238923 Product: JDT Classification: Eclipse Component: Core Reply Gus Perez says: April 10, 2005 at 1:43 am Craig, feel free to submit it via the MSDN Feedback site even if it may be an Everett-only issue. Internal Compiler Error Killed (program Cc1plus) Play with optimization settings, #pragmas and fiddling with your code until it works. Internal Compiler Error Segmentation Fault This build executed without problems.Then I rebuilt the project with the .NET 1.1 Framework, instead.

up vote 1 down vote favorite I was trying to compile my C++ program, which uses MPICH and NAG C library (I use NAG to generate random numbers), with a pgCC http://mttags.com/internal-compiler/internal-compiler-error-cl-exe.php Can an umlaut be written as line (when writing by hand)? share|improve this answer answered Mar 11 at 3:52 MKG 1 add a comment| Your Answer draft saved draft discarded Sign up or log in Sign up using Google Sign up You signed in with another tab or window.

How to change log levels for apex tests Bravo For Buckets! foo\src\fooclass.cs(50,14): error CS0584: Internal Compiler Error: stage 'CODEGEN' symbol 'foo.fooclass.fooclass()' foo\src\fooclass.cs(50,14): error CS0584: Internal Compiler Error: stage 'COMPILE' symbol 'foo.fooclass.fooclass()' 0 Comments Show all comments Tags c-sharpcsharp.cscscs-file.net2003 Products MATLAB Builder Once you determine which option is responsible, you can disable it using the optimize pragma around the function where the error occurs and continue to use the option for the rest check my blog Join today Support Terms of Use *Trademarks Privacy Cookies Publications Intel® Developer Zone Newsletter Intel® Parallel Universe Magazine Look for us on: FacebookTwitterGoogle+LinkedInYouTube English简体中文EspañolPortuguês Rate Us

Anything can go wrong, from two scripts sharing a namespace or the scripts not being for the version of Unity you are using. Nothing changed. thanks!

The Microsoft Knowledge Base has more information about C1001; see http://support.microsoft.com/default.aspx?scid=kb;en-us;134650.

Reload to refresh your session. Why don't we have helicopter airlines? linearize: bad ili #: 0 (mpisim.C: 266) PGCC-S-0000-Internal compiler error. EDIT Is there a way for me to figure out the position of the problematic line?

What are the legal consequences for a tourist who runs out of gas on the Autobahn? Reply Nick says: March 13, 2006 at 9:36 am You saved my life!! You've done something that exposed an error in the compiler. news There's not much you can do short of raising the problem with the compiler vendor.

test.cs(5,14): error CS0584: Internal Compiler Error: stage ‘CODEGEN' symbol ‘Test.Main()' test.cs(5,14): error CS0584: Internal Compiler Error: stage ‘COMPILE' symbol ‘Test.Main()' test.cs(5,14): error CS0584: Internal Compiler Error: stage ‘COMPILE' symbol ‘Test.Main()' test.cs(3,7): Is it ok to turn down a promotion? Even MSDN recommends to go to the code and play with optimization pragmas there. The workaround is just a matter of deleting the existing PDB file.

The error was shown in the 'problems' tab in the 'errors' section. Before I uninstall/reinstall Visual Studio 2008 is there something I can do such as get a more detail report and send it to Microsoft? Website runs just fine when running in debug mode but when running through IIS 7.0 I get the error. asked 7 years ago viewed 2220 times active 1 year ago Blog Stack Overflow Podcast #91 - Can You Stump Nick Craver?

To determine which option is at fault, remove options one at a time and recompile until the error message goes away. I had simmilar error: http://www.kierepka.pl/index.php?option=com_content&task=view&id=34&Itemid=1 Regards M.Kierepka Reply Oz says: November 3, 2005 at 12:08 pm That works! To work around this problem, try simplifying or changing the program near the locations listed below. We recommend upgrading to the latest Safari, Google Chrome, or Firefox.

Plausibility of the Japanese Nekomimi What is the exchange interaction? Sign in Gallery MSDN Library Forums Get started for free Ask a question Quick access Forums home Browse forums users FAQ Search related threads Remove From My Forums Asked by: Add to PropertiesController class.", t.Name)); } Build Errors: Error 1 Internal Compiler Error: stage 'BEGIN' ScriptLibrary1 Error 2 Internal Compiler Error: stage 'EMIT' ScriptLibrary1 Error 3 Internal Compiler Error: stage 'COMPILE' It's not that typical to see a message saying that the compiler in fact refuses to compile perfectly correct code. –sharptooth Jul 7 '09 at 11:09 Can you come