Home > Internal Compiler > Internal Compiler Error In Dwarf2out Finish At Dwarf2out.c

Internal Compiler Error In Dwarf2out Finish At Dwarf2out.c

Summary: Workaround for ICE in GCC 4.8 appeared in r196846. Comment 3 Jakub Jelinek 2006-05-09 04:27:59 EDT *** Bug 190955 has been marked as a duplicate of this bug. *** Note You need to log in before you can comment on See for instructions. Installing Debian on a USB stick -- live usb vs a true and full installation Update 17 March 2013: See this post for a faster, better way of creating a full check my blog

I believe it calls template bool equalLettersIgnoringASCIICase(const StringImpl&, const char (&lowercaseLetters)[length]); Comment 9 Chris Dumez 2016-02-22 10:09:22 PST (In reply to comment #8) > (In reply to comment #7) > See for instructions. Search this first! Example where this matters: a primary function template in C++ requires EH information, an explicit specialization doesn't. */ if (for_eh) { bool any_eh_needed = false; FOR_EACH_VEC_ELT (*fde_vec, i, fde) { if https://gcc.gnu.org/bugzilla/show_bug.cgi?id=56234

Immediately initialize all we can, noting that this allocation may be done before pass_final. */ dw_fde_ref dwarf2out_alloc_current_fde (void) { dw_fde_ref fde; fde = ggc_cleared_alloc (); fde->decl = current_function_decl; fde->funcdef_number = current_function_funcdef_no; FAQ Search It is currently Tue Oct 18, 2016 6:33 pm View unanswered posts | View active topics Board index All times are UTC - 6 hours Information The However, the SGI/MIPS ABI uses an initial length which is equal to DWARF_OFFSET_SIZE. symbolic debug info), by setting the parameter < 0.

  1. Bug187339 - internal compiler error: in dwarf2out_finish, at dwarf2out.c:14116 Summary: internal compiler error: in dwarf2out_finish, at dwarf2out.c:14116 Status: CLOSED UPSTREAM Aliases: None Product: Fedora Classification: Fedora Component: gcc4 (Show other bugs)
  2. Instead testing a similar > > > > Index: gcc/lto/lto.c > > =================================================================== > > --- gcc/lto/lto.c (revision 182525) > > +++ gcc/lto/lto.c (working copy)
  3. Collection of errors when compiling kernel 3.7.x on AMD FX 8150 Update 20th Feb 2013: Kernel 3.8 compiles fine on AMD FX 8150.
  4. See for instructions.
  5. fs/reiserfs/bitmap.c: In function 'scan_bitmap_block.constprop.9': fs/reiserfs/bitmap.c:236:9: warning: 'next' may be used uninitialized in this function [-Wmaybe-uninitialized] make[1]: *** [drivers] Error 2 make[1]: *** Waiting for unfinished jobs....

See for instructions. make[2]: *** [drivers/scsi] Error 2 make[1]: *** [drivers] Error 2 make: *** [debian/stamp/build/kernel] Error 2 and finally /lib/x86_64-linux-gnu/libc.so.6(__libc_start_main+0xfd)[0x2b377411eead] /usr/lib/gcc/x86_64-linux-gnu/4.7/cc1[0x4d2f51] ======= Memory map: ======== 00400000-00fd3000 r-xp 00000000 08:01 1312897 /usr/lib/gcc/x86_64-linux-gnu/4.7/cc1 011d2000-011dd000 rw-p See for instructions. lto1 has already used 12min of CPU time when linking libxul and is still running... (3min is normal) "perf top" shows: 27.92% lto1

lto1: internal compiler error: in dwarf2out_finish, at dwarf2out.c:22501 Please submit a full bug report, with preprocessed source if appropriate. Libreoffice, Op... 312. Further, the assembler can't handle any of the weirder relocation types. */ if (enc & DW_EH_PE_indirect) ref = dw2_force_const_mem (ref, true); fprintf (asm_out_file, "\t.cfi_personality %#x,", enc); output_addr_const (asm_out_file, ref); fputc ('\n', http://gcc-bugs.gcc.gnu.narkive.com/doKfLqOh/bug-c-29650-new-internal-compiler-error-in-dwarf2out-finish-at-dwarf2out-c-14129 Maybe I should look into fixing that fundamental issue instead (I'll still go forward with the speedup patch I think, it's also a consistency fix).

Richard. for unwind info). drivers/net/ethernet/intel/ixgb/ixgb_ee.c:604:1: internal compiler error: Segmentation fault Please submit a full bug report, with preprocessed source if appropriate. make[2]: *** [drivers/isdn] Error 2 make[2]: *** Waiting for unfinished jobs....

Don't optimize if an signed integer overflow would happen. */ if (p != NULL && ((offset > 0 && *p <= INTTYPE_MAXIMUM (HOST_WIDE_INT) - offset) || (offset < 0 && *p http://lists.openembedded.org/pipermail/openembedded-devel/2011-May/078343.html Installing GNU Octave on Windows XP This is a Windows XP post (my first?), so right-thinking linux people can move on. Version: WebKit Local Build Platform: Unspecified Unspecified Importance: P2 Normal Assigned To: Nobody URL: Keywords: Depends on: Blocks: Show dependency tree /graph Reported: 2016-02-22 08:06 PST by Konstantin Tokarev make[5]: *** [drivers/media/usb/gspca/topro.o] Error 1 make[4]: *** [drivers/media/usb/gspca] Error 2 make[3]: *** [drivers/media/usb] Error 2 make[3]: *** Waiting for unfinished jobs....

See for instructions. click site See PR47324. */ static void output_loc_operands (dw_loc_descr_ref loc, int for_eh_or_skip) { dw_val_ref val1 = &loc->dw_loc_oprnd1; dw_val_ref val2 = &loc->dw_loc_oprnd2; switch (loc->dw_loc_opc) { #ifdef DWARF2_DEBUGGING_INFO case DW_OP_const2u: case DW_OP_const2s: dw2_asm_output_data (2, val1->v.val_int, make[3]: *** [net/xfrm/xfrm_sysctl.o] Error 1 make[2]: *** [net/xfrm] Error 2 make[1]: *** [net] Error 2 make: *** [debian/stamp/build/kernel] Error 2 Kernel 3.7 with -O0 on AMD FX 8150 exec make kpkg_version=12.036+nmu3 incomplete_types_list needs to be a vec *because we want to tell the garbage collector about it. */ static GTY(()) vec *incomplete_types; /* A pointer to the base of a

We must emit this label if it might be used. */ if (!do_frame && (!flag_exceptions || targetm_common.except_unwind_info (&global_options) == UI_SJLJ)) return; fnsec = function_section (current_function_decl); switch_to_section (fnsec); ASM_GENERATE_INTERNAL_LABEL (label, FUNC_BEGIN_LABEL, current_function_funcdef_no); Comment 1 Jianjun He 2013-02-07 03:28:41 UTC Created attachment 29380 [details] the preprocessed file that triggers the bug the preprocessed file is tar'ed 'cause the size is out of attachment limit. Free forum by Nabble Edit this page [oe] Error building qt4e-base-image with angstrom-2010.x Marco Cavallini koansoftware at gmail.com Tue May 31 13:49:04 UTC 2011 Previous message: [oe] Error building qt4e-base-image with http://mttags.com/internal-compiler/internal-compiler-error-in-dwarf2out-frame-debug-expr-at-dwarf2out-c.php Compiling ECCE 6.4 on Debian Testing 324.

make[6]: *** [/tmp/ccQIIdf5.ltrans8.ltrans.o] Error 1 lto1: internal compiler error: in dwarf2out_finish, at dwarf2out.c:22501 Please submit a full bug report, with preprocessed source if appropriate. Board index All times are UTC - 6 hours Powered by phpBB © 2000, 2002, 2005, 2007 phpBB Group Lindqvist - a blog about Linux and Science. This gets called *after* the prologue code has been generated. */ void dwarf2out_vms_end_prologue (unsigned int line ATTRIBUTE_UNUSED, const char *file ATTRIBUTE_UNUSED) { char label[MAX_ARTIFICIAL_LABEL_BYTES]; /* Output a label to mark the

Contributors El Súper lindqvist Statcounter Simple template.

Nothing to see here. Instead testing a similar > > > > > > Index: gcc/lto/lto.c > > > =================================================================== > > > --- gcc/lto/lto.c (revision 182525) > > > +++ gcc/lto/lto.c drivers/tty/serial/jsm/jsm_neo.c: In function 'neo_intr': drivers/tty/serial/jsm/jsm_neo.c:1244:1: internal compiler error: Aborted Please submit a full bug report, with preprocessed source if appropriate. While the method of ... 70.

Alternately, leave out locations for types and decls. symbolic debug info), by setting the parameter < 0. We recommend upgrading to the latest Safari, Google Chrome, or Firefox. http://mttags.com/internal-compiler/internal-compiler-error-in-mem-loc-descriptor-at-dwarf2out-c.php Die if we exceed one uleb128 byte. */ gcc_assert (size_of_uleb128 (augmentation_size) == 1); } } dw2_asm_output_nstring (augmentation, -1, "CIE Augmentation"); if (dw_cie_version >= 4) { dw2_asm_output_data (1, DWARF2_ADDR_SIZE, "CIE Address Size");

Home | New | Search | [?] | Reports | Requests | Help | NewAccount | Log In [x] | Forgot Password Login: [x] | Report Bugzilla Bug Legal [email protected] Discussion: Briefly: Automated chroot/sandbox creation 315. The for_eh_or_skip parameter controls whether register numbers are converted using DWARF2_FRAME_REG_OUT, which is needed in the case that hard reg numbers have been processed via DWARF_FRAME_REGNUM (i.e. make[2]: *** [drivers/staging] Error 2 make[2]: *** [drivers/net] Error 2 In file included from include/linux/genhd.h:65:0, from include/linux/blkdev.h:9, from include/scsi/scsi_cmnd.h:5, from drivers/scsi/sym53c8xx_2/sym_glue.h:58, from drivers/scsi/sym53c8xx_2/sym_hipd.c:44: include/linux/fs.h:1550:49: internal compiler error: Segmentation fault Please submit

Just ignore kernel 3.7. Format For Printing -XML -Clone This Bug -Top of page Home | New | Browse | Search | [?] | Reports | Help | NewAccount | Log In Remember [x] | Contributed by Gary Funck ([email protected]). Linux OS X/Windows whoami 15 January 2013 319.

Surfraw on debian (and goosh) ► 2012 (266) ► December (14) ► November (14) ► October (24) ► September (24) ► August (8) ► July (17) ► June (34) ► May CFI = Call Frame Instruction an instruction for the DWARF2 abstract machine CIE = Common Information Entry information describing information common to one or more FDEs DIE = Debugging Information Entry The bug is not reproducible, so it is likely a hardware or OS problem. See for instructions.