Home > Internal Compiler > Internal Compiler Error In Dwarf2out Finish

Internal Compiler Error In Dwarf2out Finish

I believe it calls template bool equalLettersIgnoringASCIICase(const StringImpl&, const char (&lowercaseLetters)[length]); Comment 9 Chris Dumez 2016-02-22 10:09:22 PST (In reply to comment #8) > (In reply to comment #7) > Use this next one with caution.You can use a braced initializer-list to provide a new-initializer for the array:C* c = new C[2] {0, 0};The initializer-list must be non-empty for this to Though we should be hitting the gimple_type_leader cache only ... Home | New | Search | [?] | Reports | Requests | Help | NewAccount | Log In [x] | Forgot Password Login: [x] | Report Bugzilla Bug Legal [email protected] Discussion: have a peek at these guys

drivers/net/ethernet/intel/ixgb/ixgb_ee.c:604:1: internal compiler error: Segmentation fault Please submit a full bug report, with preprocessed source if appropriate. Comment 1 KISHIMOTO, Makoto 2006-03-30 18:19:53 EST The code is minimal fragment to reproduce the problem in SpiderMonkey. ( http://bonsai.mozilla.org/cvsblame.cgi?file=mozilla/js/src/jscpucfg.c&rev=3.25#255 ) When compile this, with options "-O0 -g -c", cause the public VOID file /tmp/test2.ii line 3256 col 17 align 8 context > (gdb) call lookup_type_die (context) $1 = (struct die_struct *) 0x7ffff58fdd70 (gdb) call debug_tree (node->created_for) https://gcc.gnu.org/bugzilla/show_bug.cgi?id=56234

lto-wrapper: fatal error: g++ returned 1 exit status compilation terminated. /home/apinski/local-binutils-gdb/bin/ld: error: lto-wrapper failed collect2: error: ld returned 1 exit status Previous message View by thread View by date Next message pinskia at gcc dot gnu.org [Bug debug/69077] [6 Regression] omnetpp I... Setting up a private git server 323.

  • pinskia at gcc dot gnu.org [Bug debug/69077] [6 Regression] omnetpp I...
  • Thus, Index: gcc/lto/lto.c =================================================================== --- gcc/lto/lto.c (revision 182525) +++ gcc/lto/lto.c (working copy) @@ -867,7 +867,11 @@ uniquify_nodes (struct data_in *data_in, if (t
  • Did the build eventually finish?
  • It should end up calling: > inline bool equalIgnoringASCIICase(const AtomicString& a, const String& b); I don't think we do have a equalIgnoringASCIICase() overload that takes a literal.
  • Here's what I have thus far: % patch -p0 < patch patching file Makefile patching file test2.ii patching file test.ii % make gcc -r -nostdlib test2.ii test.ii -w -std=gnu++0x -pipe -g
  • Libreoffice, Op... 312.
  • Posted by Microsoft on 6/28/2016 at 7:25 AM Thank you for your feedback, we are currently reviewing the issue you have submitted.
  • Libreoffice and zotero for reference manageme... 321.

See for instructions. See for instructions. Compiling ECCE 6.4 on Debian Testing 324. It involved more changes to the code than I would have liked, but it compiles now.

make[4]: *** [sound/pci/hda/patch_cmedia.o] Error 1 make[3]: *** [sound/pci/hda] Error 2 make[3]: *** Waiting for unfinished jobs.... Comment 2 Richard Biener 2013-02-07 10:42:19 UTC GCC 4.4 is no longer supported, please try GCC 4.6 or later. LTO bootstrap went fine for me, but SPEC 2k6 483.xalancbmk build ran out of memory during LTRANs (in theory we should end up using _less_ memory with the change ...) [email protected] http://gcc-bugs.gcc.gnu.narkive.com/doKfLqOh/bug-c-29650-new-internal-compiler-error-in-dwarf2out-finish-at-dwarf2out-c-14129 A more detailed explanation for the resolution of this particular item may have been provided in the comments section. 10 0 Sign into vote ID 2869042 Comments 12 Status Closed Workarounds

Did the build eventually finish? make: *** [debian/stamp/build/kernel] Error 2 Error messages when compiling kernel 3.7 on AMD FX 8150 with -O2 or -O1 exec make kpkg_version=12.036+nmu3 -f /usr/share/kernel-package/ruleset/minimal.mk debian INITRD=YES exec debian/rules INITRD=YES kernel_image kernel_headers See for instructions. Compiling Simon on Debian Testing (Simon 0.4)... 302.

Sign in to post a workaround. https://connect.microsoft.com/VisualStudio/feedback/details/2869042/new-internal-compiler-error-only-in-vs2015-update-3 And then the following happens: > > At top level: > lto1: internal compiler error: in dwarf2out_finish, at dwarf2out.c:22501 > Please submit a full bug report, > with preprocessed source if In the meantime here is a disassembly of the hot-spot. lto1 has already used 12min of CPU time when > > > linking libxul and is still running... (3min is normal) > > > > That's odd - TREE_TYPE (f1) should

pinskia at gcc dot gnu.org [Bug debug/69077] [6 Regression] omnetpp I... More about the author To be clear, it's a GCC bug causing some obsolete version of GCC to crash (ICE = internal compiler error), and this modification is a workaround for that crash. make[4]: *** [drivers/tty/ipwireless/main.o] Error 1 make[3]: *** [drivers/tty/ipwireless] Error 2 make[3]: *** Waiting for unfinished jobs.... Compiling Wine 1.5.21 with multiarch on Debia... 307.

Liberate your router: dd-wrt on Netgear WGT62... 327. Posted by Hermann Walth on 6/29/2016 at 4:41 AM Hello, I have the same problem. New internal compiler error only in VS2015 update 3 - by Dave Hawkes Status : Closed as Fixed Fixed This item has been fixed in the current or upcoming version http://mttags.com/internal-compiler/internal-compiler-error-in-dwarf2out-frame-debug-expr-at-dwarf2out-c.php If you require immediate assistance with this issue, please contact product support at http://support.microsoft.com/oas/default.aspx?prid=15825.

Insync with Google Drive and Google Docs on D... 305. Please include the complete backtrace with any bug report. This is the output: | gcc -c -isystem/home/koan/devel/build/angstrom/tmp/sysroots/x86_64-linux/usr/include -O2 -g -DIN_GCC -DCROSS_DIRECTORY_STRUCTURE -W -Wall -Wwrite-strings -Wcast-qual -Wstrict-prototypes -Wmissing-prototypes -Wmissing-format-attribute -pedantic -Wno-long-long -Wno-variadic-macros -Wno-overlength-strings -Wold-style-definition -Wc++-compat -DHAVE_CONFIG_H -I. -I. -I/home/koan/devel/build/angstrom/tmp/work/armv5te-angstrom-linux-gnueabi/gcc-cross-initial-4.5-r36.1+svnr170880/gcc-4_5-branch/gcc -I/home/koan/devel/build/angstrom/tmp/work/armv5te-angstrom-linux-gnueabi/gcc-cross-initial-4.5-r36.1+svnr170880/gcc-4_5-branch/gcc/. -I/home/koan/devel/build/angstrom/tmp/work/armv5te-angstrom-linux-gnueabi/gcc-cross-initial-4.5-r36.1+svnr170880/gcc-4_5-branch/gcc/../include

make[2]: *** [drivers/isdn] Error 2 make[2]: *** Waiting for unfinished jobs....

In the mean-time, I used the std::vector work-around. lto1 has already used 12min of CPU time when > linking libxul and is still running... (3min is normal) > > "perf top" shows: > 27.92% lto1 pinskia at gcc dot gnu.org [Bug debug/69077] [6 Regression] omnetpp I... [email protected] Reply | Threaded Open this post in threaded view ♦ ♦ | Report Content as Inappropriate ♦ ♦ [Bug lto/51635] [4.7 regression] ICE in in dwarf2out_finish, at dwarf2out.c:22494 when

Bug187339 - internal compiler error: in dwarf2out_finish, at dwarf2out.c:14116 Summary: internal compiler error: in dwarf2out_finish, at dwarf2out.c:14116 Status: CLOSED UPSTREAM Aliases: None Product: Fedora Classification: Fedora Component: gcc4 (Show other bugs) Your work-around is to remove the default argument, but this is not an option for us because the constructor is part of a 3rd party distribution library. Putting Tomato (USB) on Cisco/Linksys E2500-AU 300M Update 18/8/2014: I've since done this on a unit with a BCM5357 chip rev 2 pkg 8 as well: Update: the more I use http://mttags.com/internal-compiler/internal-compiler-error-in-mem-loc-descriptor-at-dwarf2out-c.php And indeed in the types TYPE_FIELDS we have

Compiling MPE for MPI profiling 310. It did "finish" after using ~17min of CPU-time, but only to hit the next bug: /var/tmp/mozilla-central/parser/htmlparser/src/nsScannerString.cpp:124:46: internal compiler error: in force_type_die, at dwarf2out.c:19296 [email protected] Reply | Threaded Open this post in See for instructions. Compili... 322.

array parameters are normally just pointers, but for templates it's not necessarily true! It > seems valid to use off without quotes to me. It should end up calling: inline bool equalIgnoringASCIICase(const AtomicString& a, const String& b); Comment 7 Chris Dumez 2016-02-22 09:40:01 PST (In reply to comment #6) > Comment on attachment 271923 [details] Tau + OpenMPI profiling on Debian Testing/Whe... 311.

Therefore, if you pass "off" it likely calls: > > inline bool equalIgnoringASCIICase(const String& a, const char* b); > > > > Which means we don't know the length of b See for instructions.