Home > Internal Compiler > Internal Compiler Error In Final_scan_insn

Internal Compiler Error In Final_scan_insn

Short of adding the following to each Makefile, does anyone have any thoughts on how to work around / fix this? .if (${MACHINE_ARCH} == "arm") # testglib.c chokes with "internal compiler Steps to Reproduce: 1. 2. 3. Expected results: Compiler works! Please refer to our Privacy Policy or Contact Us for more details You seem to have CSS turned off. http://mttags.com/internal-compiler/internal-compiler-error-in-final-scan-insn-at-final-c.php

See for instructions. Comment on this change (optional) Email me about changes to this bug report gcc-5 (Ubuntu) Edit Fix Released High Unassigned Edit You need to log in to change this bug's Law URL: Keywords: Depends on: Blocks: Reported: 2010-12-08 23:19 UTC by Mikael Pettersson Modified: 2011-02-02 17:56 UTC (History) CC List: 3 users (show) bernds jakub law See Also: Host: Target: Kiel traduki "sign language" respekteme? https://bugs.launchpad.net/bugs/1481333

All callers changed. (move2add_use_add2_insn): Likewise. (move2add_use_add3_insn): Likewise. (reload_cse_regs): If reload_cse_move2add changed anything, rerun reload_combine. (RELOAD_COMBINE_MAX_USES): Bump to 16. (last_jump_ruid): New static variable. (struct reg_use): New members CONTAINING_MEM and RUID. (reg_state): New See for instructions. See for instructions. How should I deal with a difficult group and a DM that doesn't help?

  1. See for instructions.
  2. Then, we didn't see the compiler error anymore.
  3. make[3]: *** [haifa-sched.o] Error 1 make[3]: Leaving directory `/mnt/scratch/objdir46/gcc' make[2]: *** [all-stage2-gcc] Error 2 make[2]: Leaving directory `/mnt/scratch/objdir46' make[1]: *** [stage2-bubble] Error 2 make[1]: Leaving directory `/mnt/scratch/objdir46' make: *** [bootstrap] Error
  4. Bigot - 2012-11-05 Confirmed present in both LTS-20120406 and in the 4.7 development series.

Be careful when to take PREV_INSN of the scanned insn. This is what happens... Here is command to reproduce mips-oe-linux-gcc -march=mips32 -mabi=32 b.c -c -fPIC b.c: In function ‘__casin’: b.c:19:1: error: could not split insn (call_insn 20 55 21 b.c:13 (parallel [ (set (reg:DF 32 P4 as none of the primary/secondary targets is HAVE_cc0.

Status: RESOLVED FIXED Alias: None Product: gcc Classification: Unclassified Component: rtl-optimization (show other bugs) Version: 4.6.0 Importance: P4 normal Target Milestone: 4.6.0 Assignee: Jeffrey A. reload_combine_recognize_const_pattern happily moves an add after a CC0 setter (but before CC0 user), breaking the requirement that CC0 setter immediately preceedes CC0 user. This is accomplished by the special negc insn that +;; has a use on the operand. (define_insn_and_split "*mov_t_msb_neg" [(set (match_operand:SI 0 "arith_reg_dest") (minus:SI (const_int -2147483648) ;; 0x80000000 @@ -11444,12 +11448,23 @@ https://gcc.gnu.org/bugzilla/show_bug.cgi?id=44685 Please include the complete backtrace with any bug report.

Ryeng on 2015-08-04 6 This bug affects 1 person Affects Status Importance Assigned to Milestone gcc Edit Unknown Unknown gcc-bugzilla #67143 You need to log in to change this bug's See for instructions. more stack exchange communities company blog Stack Exchange Inbox Reputation and Badges sign up log in tour help Tour Start here for a quick overview of the site Help Center Detailed I'll look into fixing this if/when another mspgcc release is scheduled.

storage/innobase/CMakeFiles/innobase_embedded.dir/build.make:1135: recipe for target 'storage/innobase/CMakeFiles/innobase_embedded.dir/gis/gis0sea.cc.o' failed make[2]: [storage/innobase/CMakeFiles/innobase_embedded.dir/gis/gis0sea.cc.o] Error 1 (ignored) /usr/bin/cmake -E cmake_progress_report /home/nryeng/mysql-5.7.8-rc/build/CMakeFiles Add tags Tag help Matthias Klose (doko) wrote on 2015-08-05: #1 please recheck with the GCC All callers changed. Additional info: The input file is a bit peculiar looking, as it's been passed through a program that inserts instrumentation code. No, thanks Red Hat Bugzilla – Bug432303 gcc internal compiler error in final_scan_insn Last modified: 2012-06-20 12:19:38 EDT Home | New | Search | [?] | Reports | Requests | Help

If you would like to refer to this comment somewhere else in this project, copy and paste the following link: SourceForge About Site Status @sfnet_ops Powered by Apache Allura™ Find and More about the author Comment 3 Mikael Pettersson 2010-12-09 23:48:36 UTC A bisection identified r166371 as the trigger for this bug: Author: jakub Date: Fri Nov 5 19:00:27 2010 New Revision: 166371 URL: http://gcc.gnu.org/viewcvs?root=gcc&view=rev&rev=166371 Log: After some time, the compiler finally threw the following error:

: In function `': :-117020: internal compiler error: Sign up for the SourceForge newsletter: I agree to receive quotes, newsletters and other information from sourceforge.net and its partners regarding IT services and products.

I'll attach a reduced test case that ICEs a cross to m68k-linux. How to give player the ability to toggle visibility of the wall? Bug432303 - gcc internal compiler error in final_scan_insn Summary: gcc internal compiler error in final_scan_insn Status: CLOSED WONTFIX Aliases: None Product: Red Hat Enterprise Linux 4 Classification: Red Hat Component: gcc http://mttags.com/internal-compiler/internal-compiler-error-in-rest-of-handle-final.php Norvald H.

That's why the compiler input is actually a file with a very funky name found in /var/tmp. Comment 4 David Binderman 2015-04-15 08:52:59 UTC Created attachment 35317 [details] C source code Source code from the linux kernel, which demonstrates the problem when cross compiled on AMD for blackfin. Please don't fill out this field.

Thanks, Ryan c gcc compiler-errors share|improve this question asked Dec 5 '09 at 17:20 DuneBug 6031824 add a comment| 1 Answer 1 active oldest votes up vote 6 down vote When

Instead it tries to split out the Comment 7 Kazumoto Kojima 2014-02-26 23:33:23 UTC A testresult with the patch in #6 on sh4-unknown-linux-gnu: http://gcc.gnu.org/ml/gcc-testresults/2014-02/msg01866.html Comment 8 Oleg Endo 2014-03-01 13:17:09 UTC Back to list Status: New Owner: ---- Type-Defect Priority-Medium ReportedBy-Developer Sign in to add a comment Reported by [email protected], Dec 12, 2014 Android.mk: LOCAL_PATH := $(call my-dir) include $(CLEAR_VARS) So, either it needs to use some predicate which will make such insn invalid right after split1, or it needs to cope also with the case where during splitting it can't Format For Printing -XML -Clone This Bug -Top of page Home | New | Browse | Search | [?] | Reports | Help | NewAccount | Log In Remember [x] |

Log in / Register Ubuntugcc-5 package Overview Code Bugs Blueprints Translations Answers internal compiler error: in final_scan_insn, at final.c:3020 Bug #1481333 reported by Norvald H. Could anyone explain what the above compiler errors mean and why this fix worked? Report a bug This report contains Public information Edit Everyone can see this information. news storage/innobase/CMakeFiles/innobase_embedded.dir/build.make:100: recipe for target 'storage/innobase/CMakeFiles/innobase_embedded.dir/btr/btr0btr.cc.o' failed make[2]: [storage/innobase/CMakeFiles/innobase_embedded.dir/btr/btr0btr.cc.o] Error 1 (ignored) /usr/bin/cmake -E cmake_progress_report /home/nryeng/mysql-5.7.8-rc/build/CMakeFiles [ 24%] Building CXX object storage/innobase/CMakeFiles/innobase_embedded.dir/btr/btr0cur.cc.o cd /home/nryeng/mysql-5.7.8-rc/build/storage/innobase && /usr/bin/g++-5 -DCOMPILER_HINTS -DHAVE_CONFIG_H -DHAVE_FALLOC_PUNCH_HOLE_AND_KEEP_SIZE=1 -DHAVE_IB_ATOMIC_PTHREAD_T_GCC=1 -DHAVE_IB_GCC_ATOMIC_THREAD_FENCE=1 -DHAVE_IB_GCC_SYNC_SYNCHRONISE=1

All Rights Reserved. The constant load was split out on purpose so that it can be hoisted/combined easier (I was thinking of adding an SH specific RTL pass to optimize constant loads and sharing. Comment 4 Kazumoto Kojima 2014-02-25 10:54:40 UTC Oleg, any news on this? this new insn.

Comment 4 Jerry Leichter 2008-02-11 10:02:19 EST Created attachment 294565 [details] Input file Given that some of the error messages seem to come from the preprocessor, I've attached the input that Law 2011-01-26 17:16:52 UTC More correctly, you can never move any insn between an explicit cc0 setter and cc0 user on a cc0 target. HAVE_cc0 targets should just be converted or die, but until that happens, postreload should be probably fixed. Format For Printing -XML -Clone This Bug -Top of page Home | New | Browse | Search | [?] | Reports | Help | NewAccount | Log In Remember [x] |

Ryeng (nryeng) wrote on 2015-08-06: #4 Preprocessed source for btr0cur.cc Edit (2.2 MiB, text/plain) Norvald H. changed. Format For Printing -XML -Clone This Bug -Top of page First Last Prev Next This bug is not in your last search results. On SH there are a couple of cases where constants are emitted during combine and split1 which won't be CSE'd).

PR rtl-optimization/46856 * gcc.c-torture/compile/pr46856.c: New test. Not because of your code, but because of a bug inside GCC code, which is detected by an assert. Mark as duplicate Convert to a question Link a related branch Link to CVE You are not directly subscribed to this bug's notifications.