Home > Internal Compiler > Internal Compiler Error In Pop_scope At C-decl.c

Internal Compiler Error In Pop_scope At C-decl.c

Offline #6 2005-04-29 22:00:42 whargoul Member From: Odense, Denmark Registered: 2005-04-04 Posts: 546 Re: Ati with kernel26. Comment 9 Andrew Pinski 2004-08-31 06:00:32 UTC This works for me and many other people so closing as worksforme. connected.HTTP request sent, awaiting response... 200 OKLength: 3,343 [text/x-diff]100%[====================================>] 3,343 17.55K/s 22:46:07 (17.54 KB/s) - `nvidia_6111-6629_compat2.diff' saved [3343/3343]==> Downloading acpi-dsdt-initrd-patch-v0.7d-2.6.9.patch--22:46:07-- http://gaugusch.at/acpi-dsdt-initrd-pat … This looks like a failure at compile-time because of a problem in the compiler. check my blog

So wehre wud i find the compiler sources? I have follow the instructions given in the wiki, so what is wrong? You don't have to do builds from scratch. Please visit this page to clear all LQ-related cookies. https://gcc.gnu.org/bugzilla/show_bug.cgi?id=17118

anthonymts123 Linux - General 5 07-31-2006 02:29 AM problem in compiling kernel 2.6.9 tate Fedora 4 02-01-2006 02:39 PM kernel compiling problem. The time now is 07:23 PM. Bug17118 - internal compiler error in pop_scope Summary: internal compiler error in pop_scope Status: RESOLVED WORKSFORME Alias: None Product: gcc Classification: Unclassified Component: bootstrap (show other bugs) Version: 4.0.0 Importance: P2

  • IF YOU ARE NOT THE INTENDED RECIPIENT, CONTACT THE SENDER BY E-MAIL AT AND DESTROY ALL COPIES OF THE ORIGINAL MESSAGE.
  • And since I am relativel new to xcode and OpenGL, i dont know where to go about looking for ths error.
  • Description Jean-Marc Vanel 2004-08-20 07:44:00 UTC Error during make bootstrap (on Mandrake 10) with latest CVS. ../gcc/configure --enable-threads=posix --prefix=/home/jmv/usr2/gcc \ --enable-shared --enable-languages=c++,java \ --with-x --enable-gtk-cairo \ --enable-java-awt=gtk --enable-version-specific-runtime-libs ....
  • I have run makepkg -g, and here is the output:[[email protected] kernel26]# makepkg -g==> Making package: kernel26 (Fri Apr 29 22:36:38 CEST 2005)==> Checking Runtime Dependencies...==> Checking Buildtime Dependencies...==> Retrieving Sources...==>
  • Report it to Apple at: https://bugreport.apple.com Then try to find some way to restructure your code so that you don't trigger the bug in the compiler.
  • Actually, the problem "solution by self"!

Jakalx Debian 5 08-20-2005 10:42 AM Even after compiling a new kernel I still get this problem Nikon01 Slackware 2 08-09-2003 12:52 AM Problem after compiling the kernel niac Linux - Passed==> ERROR: One or more files did not pass the validity check![[email protected] kernel26]# Why does 'config' fail? If you get a different failure every time, then it is likely that this is either a kernel bug, or a hardware problem. I used the laptop for 2 or 3 months, it's true that I had some freezes, but I thought it was due to instable Mandrake 10.

Pada View Public Profile Send a private message to Pada Find all posts by Pada « Previous Thread | Next Thread » Thread Tools Show Printable Version Display Modes Linear Mode Passed config ... In fact I never could complete a compilation from the CVS, although I tried many times during last months. More hints Find More Posts by Mithrilhall 12-20-2006, 03:57 PM #4 Mithrilhall Member Registered: Feb 2002 Location: Massachusetts Distribution: Debian (Lenny) Posts: 286 Original Poster Rep: Well I removed the twofish

make[3]: *** [drivers/char/synclinkmp.o] Error1 make[2]: *** [drivers/char] Error 2 make[1]: *** [drivers] Error 2 make[1]: Leaving directory '/usr/src/linux-2.6.18.6' make: *** [stamp-build] Error 2 Mithrilhall View Public Profile View LQ Blog Xcode - February 06, 2008 february 2008 MTWTFSS 1 2 3 4 5 6 7 8 9 10 11 12 13 14 15 16 17 18 19 Offline #3 2005-04-29 21:32:57 T-Dawg Forum Fellow From: Wilmington, NC Registered: 2005-01-29 Posts: 2,734 Re: Ati with kernel26. Click Here to receive this Complete Guide absolutely free.

Notices Welcome to LinuxQuestions.org, a friendly and active Linux Community. Home | New | Search | [?] | Reports | Requests | Help | NewAccount | Log In [x] | Forgot Password Login: [x] | Report Bugzilla Bug Legal Error while Comment 7 Jean-Marc Vanel 2004-08-20 16:40:11 UTC Subject: Re: internal compiler error in pop_scope pinskia at gcc dot gnu dot org wrote: >------- Additional Comments From pinskia at gcc dot gnu Follow the versions from those packages: - binutils-2.22.52.0.2-i486-2 - gcc-4.7.1-i486-1 - glibc-2.15-i486-8_slack14.0 Thanks!

If you had the compiler sources you would > probably discover the report of the error in file "c-decl.c" on line > 840. > > Are you using templates? > > click site Passed nvidia_6111-6629_compat2.diff ... Logged in!==> SYST ... Password Linux - General This Linux forum is for general Linux questions and discussion.

Passed acpi-dsdt-initrd-patch-v0.7d-2.6.9.patch ... Comment 2 Jean-Marc Vanel 2004-08-20 08:14:20 UTC Subject: Re: internal compiler error in pop_scope pinskia at gcc dot gnu dot org wrote: >------- Additional Comments From pinskia at gcc dot gnu Hunk #2 succeeded at 246 (offset 8 lines). news Source Code Try these examples: int (*(*foo)(void ))[3] declare bar as volatile pointer to array 64 of const int cast foo into block(int, long long) returning double cdecl C gibberish

Are you using templates? For all (two) programs >> which I use stack operations ( glPushMatrix() and glPopMatrix() ), I >> get an error whcih says :- >> >> internal compiler error: in pop_scope, at Note You need to log in before you can comment on or make changes to this bug.

On 10/10/06, David A Rowland wrote: > > At 7:40 PM -0700 10/10/06, Gargi wrote: >> Well, I am having a problem with OpenGL.

Invocation command line was $ ./configure --prefix=/opt/zabbix --enable-server --enable-agent --with-mysql --with-net-snmp --with-libcurl ## --------- ## ## Platform. ## ## --------- ## hostname = ***** uname -m = i686 uname -r = done. ==> PWD ... Well, I did not use template. Passed config ...

If you had the compiler sources you would probably discover the report of the error in file "c-decl.c" on line 840. I don't know if there are free programs for this. What should I do? - Luigi ------------------------------------------------------------ THIS E-MAIL MESSAGE IS FOR THE SOLE USE OF THE INTENDED RECIPIENT AND MAY CONTAIN CONFIDENTIAL AND/OR PRIVILEGED INFORMATION. http://mttags.com/internal-compiler/internal-compiler-error-in-make-rtl-for-nonlocal-decl.php dbauermann View Public Profile Send a private message to dbauermann Find all posts by dbauermann #5 23-10-2013, 22:10 Pada Senior Member Join Date: Apr 2012 Location: Stellenbosch, South

Jean-Marc Comment 8 Jim Wilson 2004-08-24 05:04:06 UTC Subject: Re: internal compiler error in pop_scope jmvanel at free dot fr wrote: >>------- Additional Comments From pinskia at gcc dot gnu dot This looks like a failure at compile-time because of a > problem in the compiler. Introduction to Linux - A Hands on Guide This guide was created as an overview of the Linux Operating System, geared toward new users as an exploration tour and getting started See for instructions.

See for instructions. Hint :configure your browser Monospace font in the Preferences. This book contains many real life examples derived from the author's experience as a Linux system and network administrator, trainer and consultant. Also, what gcc version?

done.==> PASV ... Just cut and paste into the right spot and try again. You are currently viewing LQ as a guest.