Home > Internal Compiler > Internal Compiler Error Segmentation Fault Gcc

Internal Compiler Error Segmentation Fault Gcc

Contents

High School Trigonometric Integration How to avoid Johnson noise in high input impedance amplifier more hot questions question feed default about us tour help blog chat data legal privacy policy work GCC 4.8+ (http://nuwen.net/mingw.html version 10.4 x86 used on Windows OS) 2. Best regards, Jan Comment 14 Jan Oberländer 2010-04-22 09:19:00 UTC (In reply to comment #13) Oh, and another thing: at the moment of the segfault, memory usage says $ ps v There is no why. have a peek at these guys

Comment 6 Jan Oberländer 2010-04-21 11:48:06 UTC A test with a g++-4.4.2 I built myself has the same problem: $ g++-4.4.2 -c -o bugtest.out -O2 bugtest.ii projects/odete/bugtest.cpp: In member function ‘bool Ask Ubuntu works best with JavaScript enabled GCC Bugzilla – Bug57625 internal compiler error: seg fault when building gcc 4.7.2 Last modified: 2015-09-21 13:38:16 UTC Home | New | Browse | Why aren't sessions exclusive to an IP address? This is the preprocessed source file leading to the segfault, created using g++ -save-temps and gzip. http://askubuntu.com/questions/312835/gcc-segmentation-fault-on-ubuntu-12-04

Internal Compiler Error Segmentation Fault Android

Word for destroying someone's heart physically Are D&D PDFs sold in multiple versions of different quality? I installed 4.4.2 with the regular ./configure ; make; make install (into my $HOME/local), is there any risk of a mixup between 4.4.1 and 4.4.2? cc1plus.exe will segfault on btInternalEdgeUtility.cpp:310:2 NOTE: The library compiles fine without any optimizations. How can I Avoid Being Frightened by the Horror Story I am Writing?

It should just be there - it's a hard dependency of gcc. On what operating system? In addition, I cannot view the preprocessed code, the segfault is at the beginning of preprocessing the code –Korbi Apr 4 '14 at 10:23 Well you have to try Edit bug mail Other bug subscribers Subscribe someone else • Take the tour • Read the guide © 2004-2016 CanonicalLtd. • Terms of use • Contact Launchpad Support • Blog

It might be hardware problem. - please attach the preprocessed source code. C++: Internal Compiler Error: Segmentation Fault (program Cc1plus) Opencv Although I'm sure you already have it, for rapid perusal, I have attached the source file that caused the seg fault. Description Jan Oberländer 2010-04-20 14:06:35 UTC Hi, unfortunately it's hard for me to tell whether this is the same as any of the other segfault bugs, so I'll have to ask Affecting: gcc-4.1 (Ubuntu) Filed here by: vlk When: 2007-10-08 Confirmed: 2008-05-09 Started work: 2008-05-09 Completed: 2008-05-09 Target Distribution Baltix BOSS Juju Charms Collection Elbuntu Guadalinex Guadalinex Edu Kiwi Linux nUbuntu PLD

Code: /usr/bin$ ls -ahl gcc* lrwxrwxrwx 1 root root 7 2008-11-01 16:03 gcc -> gcc-4.3 -rwxr-xr-x 1 root root 195K 2008-10-26 18:42 gcc-4.1 -rwxr-xr-x 1 root root 189K 2008-10-26 21:54 gcc-4.2 Code: $ gcc --version gcc (Ubuntu 4.3.2-1ubuntu12) 4.3.2 Copyright (C) 2008 Free Software Foundation, Inc. What is the expected output? make[3]: *** [_addvdi3.o] Error 1 make[3]: *** Waiting for unfinished jobs....

C++: Internal Compiler Error: Segmentation Fault (program Cc1plus) Opencv

I created a debug build for gcc-4.4.3: $ g++-4.4.3 -v Using built-in specs. Fresh clone from repository of 3.x version or the 2.x version 2. Internal Compiler Error Segmentation Fault Android What are cell phone lots at US airports for? Libgcc Internal Compiler Error Segmentation Fault See for instructions.

Linux user #433000|Ubuntu user #8750 Adv Reply February 4th, 2009 #9 snova View Profile View Forum Posts Private Message Ubuntu Cappuccino Scuro Join Date May 2008 BeansHidden! More about the author Try to isolate the source of the issue; a short, self-contained and syntactically correct example would help here. Subscribing... I second the suggestion above -- check that the build-essential package is installed. Internal Compiler Error Segmentation Fault Please Submit A Full Bug Report

  • But then, just to double-check, I wrote the Hello World program.
  • mingw32-make.exe[2]: *** [src/BulletCollision/CMakeFiles/BulletCollision.dir/CollisionDispatch/btInternalEdgeUtility.obj] Error 1 mingw32-make.exe[1]: *** [src/BulletCollision/CMakeFiles/BulletCollision.dir/all] Error 2 mingw32-make.exe: *** [all] Error 2 mingw32-make.exe[2]: Leaving directory `D:/DevLibs/bullet-read-only/build-cb' mingw32-make.exe[1]: Leaving directory `D:/DevLibs/bullet-read-only/build-cb' Process terminated with status 2 (1 minute(s), 14
  • Related 0Why I should type “./” when I want running an application that compiled by GCC in Linux?1how to install the latest gcc compiler from source on linux without messing everything
  • make all-gcc make all-target-libgcc The following error occurs: ../../../../originalsrc/gcc-4.7.2/libgcc/libgcc2.c: In function '__absvdi2': ../../../../originalsrc/gcc-4.7.2/libgcc/libgcc2.c:273:1: internal compiler error: Segmentation fault Please submit a full bug report, with preprocessed source if appropriate.
  • Executing that command from my home directory...
  • please attach the preprocessed source and the options used to build Arie Skliarouk (skliarie) wrote on 2008-09-09: #7 No options whatsoever.
  • What do you see instead?
  • I've got this on Fedora 20: $ gcc -v Using built-in specs.
  • The numbers reported by my strace output seem harmless to me (but then I'm no expert with that tool).

Join them; it only takes a minute: Sign up GCC internal compiler error: Segmentation fault up vote 5 down vote favorite 1 I try to include a file, I've defined in Comment 2 Anton Arapov 2013-11-05 23:19:06 UTC build-cross/gcc-4.7.2/libgcc/libgcc2.c:111:1: internal compiler error: Segmentation fault Please submit a full bug report, with preprocessed source if appropriate. Thanks and best regards, Jan Comment 9 Jonathan Wakely 2010-04-21 16:24:35 UTC I tested on an x86_64 box (with -m32 because your preprocessed source was made on a 32bit box so http://mttags.com/internal-compiler/internal-compiler-error-segmentation-fault-11.php Building a model to help me determine parameters of a physical water filter?

Hit a curb; chewed up rim and took a chunk out of tire. From the same location, Code: $ catchsegv gcc gcc: no input files Linux user #433000|Ubuntu user #8750 Adv Reply February 4th, 2009 #7 monkeyking View Profile View Forum Posts Private The time now is 12:50 AM.

Will they need replacement?

I have never had this happen to me before. linux gcc segmentation-fault share|improve this question edited May 3 '15 at 1:09 Jawa 2,81582032 asked May 2 '15 at 19:49 Cristofer Martins 11 1 We can't debug an internal compiler asked 2 years ago viewed 1947 times active 3 months ago Blog Stack Overflow Podcast #91 - Can You Stump Nick Craver? This strace output follows cc1plus as well.

Also please make sure the 4.7.2 you're building is unmodified. cc1plus sould exit without segfaulting. I am unable to reproduce this using the exact same gcc version and the source you provided - binary returns "Hello World!" as expected. news Already have an account?